Home > Error Code > Fix Error 1313

Fix Error 1313

Contents

If a doesn't work but b does, then this could be indicative that your IP has been blocked from reaching the freejam servers. Please validate (Error 1561) Database is read-only (Error 1570) Database object is being used by someone else. (Error 1709) Database object type is invalid (Error 1773) DataType property for field "name" No idea what cause that. For example, if you encounter Runtime error 1313 at dll files, to re-register the file, please do this: 1.

Forums New Posts FAQ Calendar Forum Actions Mark Forums Read Quick Links Today's Posts View Site Leaders Advanced Search

Forum Products Legacy Installer Products Express 5.x and earlier InstallShield Express This error usually occurs when a DLL file is missing, or not registered on your computer. Yes No Additional feedback? 1500 characters remaining Submit Skip this Thank you! Data was lost (Error 39) Object "name" is not found (Error 1766) Object "name" is not found (Error 1923) Object already has a data environment; cannot use another one with the http://repairerrors.net/error-1313.html

Windows Error Codes List

You need to note both the programmatic and the run-time context in which these errors occur. There are various registry repair tools available on the Internet that scan, analyze, and fix your computer. It must be converted to the current format before it can be executed (Error 1991) Form file "name" is invalid (Error 1686) Foxcode script "name" failure. (Error 2043) Foxcode table not

Page top Community Forums Register Help Remember Me? Here I have a great solution and it is guaranteed to help you fix PC errors and improve your computer performance. permalinkembedsavegive goldaboutblogaboutsource codeadvertisejobshelpsite rulesFAQwikireddiquettetransparencycontact usapps & toolsReddit for iPhoneReddit for Androidmobile websitebuttons<3reddit goldredditgiftsUse of this site constitutes acceptance of our User Agreement and Privacy Policy (updated). © 2016 reddit inc. Windows Blue Screen Error Codes changing destination folder Thread Tools Show Printable Version Subscribe to this Thread… Display Linear Mode Switch to Hybrid Mode Switch to Threaded Mode 10-22-2001,07:21 PM #1 Waynee Guest error: 1313.

Verify that the specified transform paths are valid. ERROR_INSTALL_PACKAGE_REJECTED 1625 (0x659) This installation is forbidden by system policy. Windows Error Codes Lookup Keep it clean and constructive. Click here to join the Robocraft Discord server or visit http://discord.me/robocraft. ENDFOR or DO CASE ...

This article will also help you troubleshoot common error messages related to Error 1313 error code that you may encounter. Error Code 1332 Join Domain The LAN Manager password returned is a NULL string. ERROR_UNKNOWN_REVISION 1305 (0x519) The revision level is unknown. ERROR_REVISION_MISMATCH 1306 (0x51A) Indicates two revision levels are incompatible. ERROR_INVALID_OWNER 1307 Contact your support personnel. ERROR_INDEX_ABSENT 1611 (0x64B) Component qualifier not present. ERROR_INSTALL_SOURCE_ABSENT 1612 (0x64C) The installation source for this product is not available. Use a valid expression for "name" property (Error 1759) Expression is not valid outside of WITH/ENDWITH (Error 1940) Expression is too complex (Error 1947) Expression used with ACOS( ) is out

Windows Error Codes Lookup

The value provided as the current password is incorrect. ERROR_ILL_FORMED_PASSWORD 1324 (0x52C) Unable to update the password. https://msdn.microsoft.com/en-us/library/087ff20z(v=vs.71).aspx Repair Errors WindowsWiki Search for: Recent Posts Zsmcsnap Zraidtray.exe Zosf.dll Zoom.exe Zoom Downloader Corrupted Ie Archives April 2010 March 2010 February 2010 January 2010 December 2009 November 2009 Categories Error Code Windows Error Codes List We appreciate the input. Windows Error Codes 0x Contact your support personnel for assistance. ERROR_INSTALL_USEREXIT 1602 (0x642) User cancelled installation. ERROR_INSTALL_FAILURE 1603 (0x643) Fatal error during installation. ERROR_INSTALL_SUSPEND 1604 (0x644) Installation suspended, incomplete. ERROR_UNKNOWN_PRODUCT 1605

How to fix Error 1313 errors. What are Error 1313 errors? Please note that this article was published earlier under WIKI_Q766518 Contents 1. Unable to process error. Click here to join, or connect manually at: cookiejar.community-ts.eu Join us on IRC! Windows Error Codes And Solutions Pdf

If you cannot pull out the paper, open the paper output tray. How to Fix Runtime error 1313? #1 Since Runtime error 1313 is related to missing DLL files, you can re-register the registry list to fix Runtime error 1313 issue. Verify that the update package exists and that you can access it, or contact the application vendor to verify that this is a valid Windows Installer update package. ERROR_PATCH_PACKAGE_INVALID 1636 In certain cases the error can have more parameters in its format.

If you unplug the power cord, all the faxes stored in the machine's memory are deleted. Error 1392 The File Or Directory Is Corrupted And Unreadable Cannot write .SCX file (Error 1968) Only insertable objects are allowed in General fields (Error 1436) Only structural tags can be defined as candidate (Error 1885) Operation is invalid for a This article shows you how to fix Windows based Error 1313 errors both manually and automatically.

Complete that installation before proceeding with this install. ERROR_INSTALL_PACKAGE_OPEN_FAILED 1619 (0x653) This installation package could not be opened.

If that doesn't work, try from a different internet connection/change your IP address. The calling process has not registered as a logon process. ERROR_LOGON_SESSION_EXISTS 1363 (0x553) Cannot start a new logon session with an ID that is already in use. ERROR_NO_SUCH_PACKAGE 1364 Note When reloading the paper, confirm that you are using the paper suited for printing and are loading it correctly. System Error Code 1400 Invalid Window Handle Error Fix.

We appreciate your feedback. To fix it after getting a 1313 error, you just have to restart your client and try and log in again.This error was caused by one of your garage slots missing Do these Win95 and ME machines have a D:\ drive? Sometimes the code is returned by a function deep in the stack and far removed from your code that is handling the error.

The system will be restarted so the changes can take effect. ERROR_PATCH_TARGET_NOT_FOUND 1642 (0x66A) The upgrade cannot be installed by the Windows Installer service because the program to be upgraded Advertisements. ← Previous Post Next Post → If you enjoyed this article please consider sharing it! Subclassed properties ignored. (Error 2003) OLE error code 0x"name" (Error 1426) OLE exception error "name". Ive heard it had something to do with your account getting stuck, but even fresh accounts of mine fail. 9 commentsshareall 9 commentssorted by: besttopnewcontroversialoldrandomq&alive (beta)[–]GeckoEidechseRobocraft is my gaming side chick 2 points3

Anyway if I run the Setup.exe for InstallShield from the CDROM it is fine. The volume C:\ is currently unavailable. The property is ignored (Error 1584) Error reading file (Error 1104) Error reading the resource (Error 1296) Error saving the OLE object (Error 1422) Error with "name" - "property": "error" (Error Attach the rear cover.

It is a really common problem for windows users which crashes now and then. If you cannot remove the paper or the paper tears inside the machine, or if the paper jam error continues after removing the paper, contact the service center. Please reopen (Error 1977) Execution was canceled by the user (Error 1523) Expression evaluated to an illegal value (Error 46) Expression evaluator failed (Error 67) Expression has been re-entered while the What's New?

Tony Crabels Intraday Signal Chart - Largest database of free indicators, oscillators, systems and other useful tools for trading system developers…. Downloads and tools Windows 10 dev tools Visual Studio Windows SDK Windows Store badges Essentials API reference (Windows apps) API reference (desktop apps) Code samples How-to guides (Windows apps) Learning resources To convert it, type MODIFY LABEL file (Error 1510) Invalid key length (Error 112) Invalid locale ID. (Error 2026) Invalid operation for offline view (Error 2011) Invalid operation for offline view How to Fix Runtime error 1313?

The Update and Key field properties have been reset to the default values (Error 1568) View file is invalid (Error 127) Views require either DB_BUFOPTROW or DB_BUFOPTTABLE (Error 1597) Visual FoxPro Contact your support personnel. ERROR_INSTALL_LOG_FAILURE 1622 (0x656) Error opening installation log file. Corrupted system files entries can threaten the well-being of your computer.