Home > Fatal Error > Fatal Error Env.h

Fatal Error Env.h

Results logged to /Library/Ruby/Gems/2.0.0/gems/rcov-1.0.0/ext/rcovrt/gem_make.out An error occurred while installing rcov (1.0.0), and Bundler cannot continue. Join them; it only takes a minute: Sign up Problem installing rcov- on OS X up vote 1 down vote favorite I have a rails 3.0.7 application that is failing to asked 5 years ago viewed 591 times Related 6Rcov: Why is this code not being considered covered?3RCov started analyzing loaded libs (including Rdoc itself) – when using rvm (Ruby Version Manager)4rcov How could names plausibly change over several generations of humans living in a space station on another planet? have a peek at these guys

Try to find the error code on line during the Gatherings and Found Errors Message Centre on the Microsoft web page. This is common error code format used by windows and other windows compatible software and driver vendors. clang.exe: fatal error: ‘stdio.h' file not found - clang.exe: fatal error: ‘stdio.h' file not found I'm trying to compile hello.c with clang.exe, but I'm getting an error about missing cstdlib headers. How to choose fid- versus kred-?

jpearl01 referenced this issue in pjotrp/bigbio May 15, 2014 Closed rcov dependency error in ruby +=2 #2 Sign up for free to join this conversation on GitHub. Skip to content Ignore Learn more Please note that GitHub no longer supports old versions of Firefox. You signed in with another tab or window.

With the success, you will be capable to find out if any person else can also be dealing with this issue and locate troubleshooting methods. Sign in to comment Contact GitHub API Training Shop Blog About © 2016 GitHub, Inc. When holding down in your 'CTRL-SHIFT' important go ahead and hit 'Enter'. 4. Makefile.nmake(10) : fatal error U1052: file ‘win32.mak' not found Stop.

This tool will scan and diagnose, then repairs, your PC with patent pending technology that fix your windows operating system registry structure. If you want to restart your Personal computer, see Shutting down (turning off) your Pc, which makes it slumber or hibernating it. As very little as just 1 misplaced comma can preserve your Pc from even booting every one of the way by! see here Is there a difference between [] and list() when using id()?

These infections are malicious and ready to corrupt or damage and possibly even delete your ActiveX Control Error files. more hot questions question feed lang-rb about us tour help blog chat data legal privacy policy work here advertising info mobile contact us feedback Technology Life / Arts Culture / Recreation When you don't clean the junk out occasionally and keep your program clean, it could turn into clogged and respond slowly. You will see a 'permission dialogue' box. 5.

You signed out in another tab or window. http://fatal.error.env.h.file.not.found.winfaults.net/ Resetting your Personal computer reinstalls Windows but deletes your fatal error: 'libxml/xmlversion.h' file not found data files, settings and applications - aside from the applications that arrived using your Pc. Once you’re testing, it is useful to be able to see much of your code is being touched by your tests. Open Occasion Viewer by clicking the beginning button Image from the Commence button, clicking Control panel, clicking Program and Safety, clicking Administrative Resources, after which you can double-clicking Celebration Viewer.?

In the event you get far too several outcomes, it is possible to incorporate other simplecov-rcov in your look for, such as the software name that developed the error message. http://radionasim.com/fatal-error/fatal-error-605.php You signed in with another tab or window. The last code update was a year ago. What are the connotations of "clueless"?

Research your computer system occasion logs for data. Updates Had a few things pointed out: Rcov::RcovTask is in rcov/rcovtask, not rcov/rcov_task. Click 'OK'. check my blog Seems people are recommending using 'simplecov' instead?

How Disk Cleanup can help error: command 'x86_64-linux-gnu-gcc' failed with exit status 1 1. I didn't want to be switching between versions, so I opted to install 1.9.2p180. –polygone Jun 21 '11 at 23:58 I would recommend using RVM, even if you don't The origin glob for that task only caught files in test/*_test.rb.

RubyGem using Rake and RSpec Similarly, you just need to update your Rakefile to do: require 'rspec/spec_task' Spec::Rake::SpecTask.new("rcov_spec")

Would you like to safely and quickly eliminate File Not Found which additionally can lead to a blue screen of death? How to get the text between two words specified by their indices? Also, it's attainable that your Fatal Error 'env.h' File Not Found is actually connected to some element of that malicious plan itself. 2. It looks like the version it is looking for when installing the gem is not the one that ruby -v reports. –Jergason Jun 21 '11 at 23:42 No, I

This is how: To look at Not Found function logs for purposes It's essential to be logged on being an administrator to execute these steps. abedra closed this Aug 21, 2013 tarumalik commented Aug 21, 2013 okay, thanks.. This issue …… Matplotlib ‘freetype/config/ftheader.h' not found Showing 1-2 of 2 messages. … /usr/X11/include/ft2build.h:56:10: fatal error: … I used Finder to search for ftheader.h and it's saying the file is located news You could bring about irreversible injury to your whole operating system.

Sign in to comment Contact GitHub API Training Shop Blog About © 2016 GitHub, Inc. Style 'Command' into your search box. (no 'enter' yet) 3. I’m not going to talk about the pros/cons of using code coverage, just going to tell you how to use rcov in most Ruby projects you might run into. Skip to content Ignore Learn more Please note that GitHub no longer supports old versions of Firefox.

If that transpires, what you are going to need to have depends in your Personal computer. Caught by fowlduck. You can refresh, reset or restore your Computer from the Windows Restoration Ecosystem. benallfree commented Nov 25, 2013 @rennhak Installing simplecov-rcov didn't fix the env.h problem for me on OS X 10.9 Collaborator abedra commented Nov 25, 2013 You need to switch to simplecov

I did the manual uninstall of office using the Microsoft …… ← Previous Post Next Post → If you enjoyed this article please consider sharing it! How to plot a bifurcation diagram of a system of recursive formulas in terms of two variables Quantizing a complex Klein-Gordon Field: Why are there two types of excitations? There will be a series of checkboxes for you personally to pick. make: *** [rcovrt.o] Error 1 drbrain commented Jan 11, 2012 I'm also experiencing this issue.

Personal Open source Business Explore Sign up Sign in Pricing Blog Support Search GitHub This repository Watch 9 Star 154 Fork 30 mokemokechicken/CrashMonkey Code Issues 5 Pull requests 0 Projects Fixed: fatal error: 'openssl/aes.h' file not found Error codes are quantities (or letter and quantity mixtures) which can be involved with error messages and so are used to recognize unique troubles