Home > Fatal Error > Fatal Error Quicktime

Fatal Error Quicktime

Software program problems. DomT4 commented Sep 27, 2016 Aye. and if anyone else knows the correct way to force no address sanitizer on the builds? I install lots of packages during this install, but only the quicktime msi's fail. http://radionasim.com/fatal-error/fatal-error-3-during.php

Related Links Rembo Auto-Deploy Support 下载详细信息: Microsoft .NET Framework 3.5 Service pack 1 (Full Package) - 简体中文 List of changes and fixed issues in the .NET Framework 3.5 Service Pack 1 It went through the uninstall process, but at the end I got an Apple message saying that there was a problem with the uninstall, which had been aborted. to macOS 10.12 and Xcode 8.0 broken formulae Jul 17, 2016 aw1621107 commented Jul 23, 2016 • edited Tried building qt5 on 10.12 from a slightly modified qt5 formula. I followed the instructions and whaa-laa, no more error message. https://discussions.apple.com/thread/2550665?tstart=0

Signed-off-by: Misty De Meo 083c7a8 mistydemeo added a commit that referenced this issue Jun 23, 2016 mistydemeo tor: To activate it, click the "Start" button and enter "memory" in the "Run" field. All rights reserved. Not sure what happened earlier, but seeing as I can't reproduce it, isn't much I can do.

so splendid: https://gist.github.com/ilovezfs/67795d2df41f74fc25f448d48600671d zmwangx commented Sep 16, 2016 GHC just won the annual best fatal error message award: ghc: panic! (the 'impossible' happened) 👍 2 😄 1 zmwangx commented Sep I also deleted everything that has to do with apple, and ipod, itunes and all of that in the process. The one that was working had CLT installed, while the failing had only Xcode. Will report back.

Could have sworn I had a missing libssl error or something like that... Attachments (3) 45557.txt​ (942 bytes) - added by [email protected] 2 years ago. It assumes that clock_getcpuclockid exists if _POSIX_CPUTIME and CLOCK_PROCESS_CPUTIME_ID are defined. https://trac.macports.org/ticket/52069 Page 1 of 1 (8 items) Sort Posts: Oldest to newest Newest to oldest Previous Next Sun, Dec 20 2015 12:28 PM Dave Mann Joined on Tue, Jul 4 2006 London

Camera(s) PXW-X70, HDR-FX1, Hero 3+ | MC 8.6.3 | QT 7.7.9 | BCC 10.0.2 | Boris RED 5.5 | Windows 10 Pro x64 | System: P6X58D-E, Core i7 960, Quadro K4200... If you're new to Tech Support Guy, we highly recommend that you visit our Guide for New Members. Upstream patch was merged into latest release. kode54 commented Sep 6, 2016 Well, this looks like an interesting one: /usr/bin/install -c -m 644 fc-validate.1 '/usr/local/Cellar/fontconfig/2.12.1/share/man/man1' libtool: install: /usr/bin/install -c .libs/fc-validate /usr/local/Cellar/fontconfig/2.12.1/bin/fc-validate Making install in conf.d /Applications/Xcode-beta.app/Contents/Developer/usr/bin/make install-am make[3]:

mistydemeo referenced this issue Jun 16, 2016 Closed ghc: fix build on 10.12 #2029 4 of 4 tasks complete zhiayang commented Jun 16, 2016 Ah, thank you @mistydemeo. https://forums.techguy.org/threads/quicktime-fatal-error.602617/ The build looks for libssl, if I remember correctly, and fails to find it without passing the OpenSSL lib directory as an explicit library search directory. That does help in your case I realize but it explains why I haven't stumbled on this one. up: It builds successfully with Xcode8.

and if that works, we should ask the upstream to backport the fix to the 3.0 and 3.1 branch. http://radionasim.com/fatal-error/fatal-error-605.php I tried downloading QuickTime again on it's own, but it still would not open. iMac MC 8.4.4 OS X 10.10.4 i5 3.2 GHz, 16GB RAM, GT 755M 1024MB / MacBookPro MC 8.4.4 Pro OS X 10.10.4 i7 2.3 GHz, 16GB RAM, Intel Iris Pro 1536MB make[1]: *** [HiRes.o] Error 1 cc -c -fno-common -DPERL_DARWIN -mmacosx-version-min=10.12 -fno-strict-aliasing -pipe -fstack-protector-strong -I/usr/local/include -DPERL_USE_SAFE_PUTENV -Wall -Werror=declaration-after-statement -Wextra -Wc++-compat -Wwrite-strings -Wthread-safety -O3 -DVERSION=\"1.9733\" -DXS_VERSION=\"1.9733\" "-I../.." -DTIME_HIRES_NANOSLEEP -DTIME_HIRES_CLOCK_GETTIME -DTIME_HIRES_CLOCK_GETRES -DTIME_HIRES_CLOCK_NANOSLEEP -DTIME_HIRES_CLOCK -DTIME_HIRES_STAT=1

When system files are missing or corrupted, data that is essential to run software applications properly cannot be linked correctly. extink commented Sep 14, 2016 @daenney: building does nog give any errors, but using sqlite with an import fails. Hacked a solution in 8311571 temporarily. check my blog wxWidgets-3.0-for-Sierra.diff​ (1.8 KB) - added by mojca (Mojca Miklavec) 3 months ago.

Edit: wrap some code properly theeternalsw0rd commented Aug 10, 2016 qtwebengine also has the bluetooth header issue. Member ilovezfs commented Sep 16, 2016 upstream GHC is looking into it as well since Stack has been ruled out as the cause. How to read the following Itinerary Is there such thing as a "Black Box" that decrypts internet traffic?

Qt 5.5 introduced an optional usage of Apple's SecureTransport, and 5.6 turned it on by default.

But a restart is usually enough to break the grip.) Posted on Aug 21, 2010 7:57 AM View answer in context Q: QuickTime fatal error during uninstalling Hide Question All replies no configure: error: in `/private/tmp/sqlite-20160818-43453-1kn1cos/sqlite-autoconf-3140100': configure: error: C compiler cannot create executables See `config.log' for more details Since auto* seems to die, I can only assume it affects a fair amount In the smsts.log I see a 0x80070643 error with nog explanation whatsoever. I'm checking on the cups stuff now.

Top section updated. Go to C:\Program Files, then delete the entire QuickTime folder. 2. zmwangx commented Sep 8, 2016 Damn, PyPy still failing: https://bot.brew.sh/view/Testing/job/Homebrew%20Sierra%20Testing/477/ This time I took a closer look: [translation:ERROR] CompilationError: CompilationError(err=""" ld: library not found for -lrt clang: error: linker command failed news app bundles found in the package1Screencapture sandox error on Sierra1Strange SceneKit Linker Error in Xcode 8 Beta 68Getting unknown error about “dynamic accessors failing” after updating to macOS1XCode: No .app bundles

Apple may provide or recommend responses as a possible solution based on the information provided; every potential issue may involve several factors not detailed in the conversations captured in an electronic Or you could edit it directly, but keep a copy of the original just in case. zmwangx commented Sep 7, 2016 @DomT4 Cool. comment:14 Changed 2 months ago by mojca (Mojca Miklavec) Cc [email protected]… added see also #45557 comment:15 Changed 2 months ago by [email protected]… Hi guys, the patch solve the problem!

Average Rating 0 11947 views 05/31/2010 Software Deployment National Instruments NI .NET Framework 3 Hello all, I'm tryingh to install quicktime (quicktime.msi and the appleapplicationsupport.msi) during my Windows 7 OSD Tasksequence However it doesn't work when you run it in the tasksequence :S Answered 05/31/2010 by: Zhoerd Please log in to comment Please log in to comment 0 In the program installing So, I tried uninstalling QuickTime. Such incidents often result in the corruption or even total deletion of essential Windows system files.

QuickTime.h is no longer available on OS X 10.12 (Sierra), and both the header and the framework seem unnecessary for compilation - at least as of 10.11 (El Capitan).