Home > Fatal Error > Fatal Error U1073

Fatal Error U1073

Contents

Foo 2. EnterpriseSocial Q&A Copyright © 2015 DZone, Inc. United States English English IBM® Site map IBM IBM Support Check here to start a new keyword search. Generate rpm with a custom build number Getting build error: "NMAKE: fatal error U1077: '..\tools\rdps.py': return code '0x1' nmake /f Makefile.nmake all error Win64 build problems Source code main file of http://radionasim.com/fatal-error/fatal-error-u1073-don-t-know-how-to-make.php

ZSH wildcard expression limiting repetition support? Submit feedback to IBM Support 1-800-IBM-7378 (USA) Directory of worldwide contacts Contact Privacy Terms of use Accessibility So perhaps you could help me by explaining why This works LIBS +=$$quote(-LC:\Program Files\Basler\pylon 4\pylon\lib\Win32)\ -lPylonBase_MD_VC100\ and this does not win32:CONFIG(release, debug|release): LIBS += -L$$PWD/../../../../../../.."/Program Files/Basler/pylon 4/pylon/lib/Win32/ -lPylonBase_MD_VC100" else:win32:CONFIG(debug, debug|release): LIBS The problems might have been because of this. https://msdn.microsoft.com/en-us/library/65faht2w.aspx

Nmake Fatal Error U1073 Don't Know How To Make C Program

What reason could change people's mentality to treat each other as members of one kind? File 'upx303w.zip' already there; not retrieving.

Extracting '/cygdrive/c/Wireshark-win32-libs-1.12/upx303w.zip' into '/cygdrive/c/Wireshark-win32-libs-1.12/.' Verifying that the DLLs and EXEs in . and may lead to the correct bit of the Makefile/PRO file faster.

Watson Product Search Search None of the above, continue with my search Rose RealTime compilation error: "NMAKE : fatal error U1073: don't know how to make RTcompile" with ClearCase Dynamic view So in conclusion, the problem was with my WinDDK install, not with the project itself, and installing a newer version fixed it. These should show in the Qt Creator Compiler Output tab. Nmake Verbose are executable.

Wireshark is ready to build. (27 Feb '15, 02:34) Dhruv Gupta showing 5 of 6 show 1 more comments One Answer: oldestnewestmost voted 0 OK, it appears to me

In fact, I just checked it, and if I replaced WXP with WXP2, it fails. U1073 Code share|improve this answer answered Nov 13 '14 at 11:23 sashoalm 19.5k34155334 add a comment| Your Answer draft saved draft discarded Sign up or log in Sign up using Google Sign Could a Universal Translator be used to decipher encryption? http://www.qtcentre.org/threads/63203-build-mesage-NMAKE-fatal-error-U1073-don-t-know-how-to-make-C-Program When I try the following, nmake Makefile.win PREFIX="c:\Program Files\apr" I get the following error: NMAKE: fatal error u1073: Dont know how to make 'Makefile.win' Does anyone know the reason for this

You may have to register before you can post: click the register link above to proceed. Nmake Command To start viewing messages, select the forum that you want to visit from the selection below. I cannot get past this message. Powered by vBulletin Version 4.1.9 Copyright ©2000 - 2016, Jelsoft Enterprises Ltd., © 2006–2010 Qt Centre - The Ultimate Qt Community site Nokia and its respective logos are trademarks of Nokia

U1073 Code

Answered Your Question? 1 2 3 4 5 Document needs work? NMAKE : fatal error U1073: don't know how to make 'Wireshark-win32-libs-1.12\c-a res-1.9.1-1-win32ws\bin\libcares-2.dll' Stop. Nmake Fatal Error U1073 Don't Know How To Make C Program If targetname is a macro invocation, be sure it does not expand to a null string. Nmake U1077 up vote 1 down vote favorite I am trying to install apr-1.4.5 in Windows.

Join them; it only takes a minute: Sign up What is the fix for “NMAKE: fatal error u1073”? http://radionasim.com/fatal-error/fatal-error-3-during.php Please download a browser that supports JavaScript, or enable it if it's disabled (i.e. link answered 27 Feb '15, 03:54 grahamb ♦ 17.4k●3●28●188 accept rate: 21% its done.., thanks grahamb (04 Mar '15, 19:38) Dhruv Gupta It might help others if you describe what your My Profile | RSS | Privacy | Legal | Contact NI © 2014 National Instruments Corporation. Nmake Fatal Error U1073 Don T Know How To Make Clean

Do I need to worry about rain water getting into the open ground socket? more stack exchange communities company blog Stack Exchange Inbox Reputation and Badges sign up log in tour help Tour Start here for a quick overview of the site Help Center Detailed Related Links: Product Manuals: Using External Code in LabVIEW Attachments: - mult.lvm - mult.c Report Date: 01/14/2003 Last Updated: 02/19/2008 Document ID: 2TDG41DS Your Feedback! check my blog Wireshark documentation and downloads can be found at the Wireshark website.

Qt Centre is a community site devoted to programming in C++ using the Qt framework. U1073 Mitsubishi We appreciate your feedback. Qatto last edited by Hello, Am trying to build Qt with Nmake on windows but end up with the error: NMAKE : fatal error U1073: don't know how to make 'sub-src'

Home Forum Today's Posts FAQ Calendar Forum Actions Mark Forums Read Quick Links View Site Leaders Docs Contest FAQ Blogs Links What's New?

The content you requested has been removed. Does homebrewed beer have a "Golden Age"? What am I doing wrong? U1073 Ford NoScript).

Could anyone please show me how to fix this. Reply With Quote 23rd July 2015,23:05 #5 BigThrum View Profile View Forum Posts View Blog Entries View Articles Beginner Join Date Jul 2012 Posts 7 Qt products Platforms Re: build mesage From your output, the first run of verify_tools looks odd, you have the 32 bit amd64 compiler listed and the 32 bit x86 linker and the nmake item should I think news My Build Output: BUILD: Compile and Link for x86 BUILD: Loading c:\winddk\7600.16385.0\build.dat...

I found this similar question - driver build is failing for amd64 via winddk, but there the OP did has not included relevant information such as his build output, and his in command prompt0NMAKE fatal error U1077 in Qt build with webkit Hot Network Questions Why is onboard/inflight shopping still a thing? BUILD: Computing Include file dependencies: BUILD: Start time: Thu Nov 13 12:04:25 2014 BUILD: Examining c:\src directory tree for files to compile. Makefile:350: recipe for target 'qfilesystemengine_win.o' failed mingw32-make: *** [qfilesystemengine_win.o] Error 1 Building qmake failed, return code 2 Web/Desktop Developer Reply Quote 0 JKSH Moderators last edited by Did you clean your

Any suggestions would be appreciated. The time now is 19:16. What makes up $17,500 cost to outfit a U.S. If you have any problems with the registration process or your account login, please contact us. + Reply to Thread Results 1 to 7 of 7 Thread: build mesage - NMAKE